Information card for entry 7034664
Formula | C52 H40 Cl2 Cu4 N10 O46 Si W12 |
Calculated formula | C52 H38 Cl2 Cu4 N10 O46 Si W12 |
Title of publication | Polyoxometalate-based organic-inorganic hybrid compounds containing transition metal mixed-organic-ligand complexes of N-containing and pyridinecarboxylate ligands. |
Authors of publication | Zhao, De-Chuan; Hu, Yang-Yang; Ding, Hong; Guo, Hai-Yang; Cui, Xiao-Bing; Zhang, Xiao; Huo, Qi-Sheng; Xu, Ji-Qing |
Journal of publication | Dalton transactions (Cambridge, England : 2003) |
Year of publication | 2015 |
Journal volume | 44 |
Journal issue | 19 |
Pages of publication | 8971 - 8983 |
a | 15.07 ± 0.004 Å |
b | 13.496 ± 0.003 Å |
c | 18.814 ± 0.005 Å |
α | 90° |
β | 90.953 ± 0.004° |
γ | 90° |
Cell volume | 3826 ± 1.7 Å3 |
Cell temperature | 296 ± 2 K |
Ambient diffraction temperature | 296 ± 2 K |
Number of distinct elements | 8 |
Space group number | 14 |
Hermann-Mauguin space group symbol | P 1 21/n 1 |
Hall space group symbol | -P 2yn |
Residual factor for all reflections | 0.1086 |
Residual factor for significantly intense reflections | 0.1076 |
Weighted residual factors for significantly intense reflections | 0.23 |
Weighted residual factors for all reflections included in the refinement | 0.2304 |
Goodness-of-fit parameter for all reflections included in the refinement | 1.054 |
Diffraction radiation wavelength | 0.71073 Å |
Diffraction radiation type | MoKα |