Information card for entry 7034665
Formula | C60 H40 Cl4 Cu4 N10 O44 Si W12 |
Calculated formula | C60 H40 Cl4 Cu4 N10 O44 Si W12 |
Title of publication | Polyoxometalate-based organic-inorganic hybrid compounds containing transition metal mixed-organic-ligand complexes of N-containing and pyridinecarboxylate ligands. |
Authors of publication | Zhao, De-Chuan; Hu, Yang-Yang; Ding, Hong; Guo, Hai-Yang; Cui, Xiao-Bing; Zhang, Xiao; Huo, Qi-Sheng; Xu, Ji-Qing |
Journal of publication | Dalton transactions (Cambridge, England : 2003) |
Year of publication | 2015 |
Journal volume | 44 |
Journal issue | 19 |
Pages of publication | 8971 - 8983 |
a | 12.186 ± 0.002 Å |
b | 12.977 ± 0.003 Å |
c | 14.887 ± 0.003 Å |
α | 102.93 ± 0.03° |
β | 91.43 ± 0.03° |
γ | 102.46 ± 0.03° |
Cell volume | 2233.8 ± 0.9 Å3 |
Cell temperature | 293 ± 2 K |
Ambient diffraction temperature | 293 ± 2 K |
Number of distinct elements | 8 |
Space group number | 2 |
Hermann-Mauguin space group symbol | P -1 |
Hall space group symbol | -P 1 |
Residual factor for all reflections | 0.1007 |
Residual factor for significantly intense reflections | 0.1001 |
Weighted residual factors for significantly intense reflections | 0.2179 |
Weighted residual factors for all reflections included in the refinement | 0.2181 |
Goodness-of-fit parameter for all reflections included in the refinement | 1.007 |
Diffraction radiation wavelength | 0.71073 Å |
Diffraction radiation type | MoKα |