Information card for entry 7034666
Formula | C52 H40 Cl2 Cu4 N10 O44 Si W12 |
Calculated formula | C52 H40 Cl2 Cu4 N10 O44 Si W12 |
Title of publication | Polyoxometalate-based organic-inorganic hybrid compounds containing transition metal mixed-organic-ligand complexes of N-containing and pyridinecarboxylate ligands. |
Authors of publication | Zhao, De-Chuan; Hu, Yang-Yang; Ding, Hong; Guo, Hai-Yang; Cui, Xiao-Bing; Zhang, Xiao; Huo, Qi-Sheng; Xu, Ji-Qing |
Journal of publication | Dalton transactions (Cambridge, England : 2003) |
Year of publication | 2015 |
Journal volume | 44 |
Journal issue | 19 |
Pages of publication | 8971 - 8983 |
a | 14.797 ± 0.003 Å |
b | 13.334 ± 0.003 Å |
c | 23.821 ± 0.007 Å |
α | 90° |
β | 126.2 ± 0.02° |
γ | 90° |
Cell volume | 3792.7 ± 1.9 Å3 |
Cell temperature | 293 ± 2 K |
Ambient diffraction temperature | 293 ± 2 K |
Number of distinct elements | 8 |
Space group number | 14 |
Hermann-Mauguin space group symbol | P 1 21/c 1 |
Hall space group symbol | -P 2ybc |
Residual factor for all reflections | 0.0945 |
Residual factor for significantly intense reflections | 0.0894 |
Weighted residual factors for significantly intense reflections | 0.2027 |
Weighted residual factors for all reflections included in the refinement | 0.2051 |
Goodness-of-fit parameter for all reflections included in the refinement | 1.063 |
Diffraction radiation wavelength | 0.71073 Å |
Diffraction radiation type | MoKα |