Information card for entry 7035241
Formula | C40 H32 Cl4 P4 S6 Sn |
Calculated formula | C40 H32 Cl4 P4 S6 Sn |
Title of publication | Instability of metal 1,3-benzodi(thiophosphinoyl)methandiide complexes: formation of hafnium, tin and zirconium complexes of 1,3-benzodi(thiophosphinoyl)thioketone dianionic ligand [1,3-C6H4(PhPS)2CS](2.). |
Authors of publication | Yang, Ya-Xiu; Li, Yongxin; Ganguly, Rakesh; So, Cheuk-Wai |
Journal of publication | Dalton transactions (Cambridge, England : 2003) |
Year of publication | 2015 |
Journal volume | 44 |
Journal issue | 28 |
Pages of publication | 12633 - 12639 |
a | 11.9643 ± 0.0005 Å |
b | 12.835 ± 0.0006 Å |
c | 14.6553 ± 0.0005 Å |
α | 90° |
β | 90.804 ± 0.002° |
γ | 90° |
Cell volume | 2250.27 ± 0.16 Å3 |
Cell temperature | 103 ± 2 K |
Ambient diffraction temperature | 103 ± 2 K |
Number of distinct elements | 6 |
Space group number | 14 |
Hermann-Mauguin space group symbol | P 1 21/n 1 |
Hall space group symbol | -P 2yn |
Residual factor for all reflections | 0.0363 |
Residual factor for significantly intense reflections | 0.029 |
Weighted residual factors for significantly intense reflections | 0.0659 |
Weighted residual factors for all reflections included in the refinement | 0.0698 |
Goodness-of-fit parameter for all reflections included in the refinement | 1.037 |
Diffraction radiation wavelength | 0.71073 Å |
Diffraction radiation type | MoKα |