Information card for entry 7035399
Formula | C17 H12 Cl N O |
Calculated formula | C17 H12 Cl N O0.997 |
Title of publication | Synthesis of a series of new platinum organometallic complexes derived from bidentate Schiff-base ligands and their catalytic activity in the hydrosilylation and dehydrosilylation of styrene. |
Authors of publication | Lachachi, M. Belhadj; Benabdallah, Tayeb; Aguiar, Pedro M.; Youcef, M. Hadj; Whitwood, Adrian C.; Lynam, Jason M. |
Journal of publication | Dalton transactions (Cambridge, England : 2003) |
Year of publication | 2015 |
Journal volume | 44 |
Journal issue | 26 |
Pages of publication | 11919 - 11928 |
a | 4.69799 ± 0.00014 Å |
b | 20.2659 ± 0.0008 Å |
c | 13.4966 ± 0.0004 Å |
α | 90° |
β | 93.83 ± 0.003° |
γ | 90° |
Cell volume | 1282.13 ± 0.07 Å3 |
Cell temperature | 110.1 ± 0.2 K |
Ambient diffraction temperature | 110.1 ± 0.2 K |
Number of distinct elements | 5 |
Space group number | 14 |
Hermann-Mauguin space group symbol | P 1 21/n 1 |
Hall space group symbol | -P 2yn |
Residual factor for all reflections | 0.0493 |
Residual factor for significantly intense reflections | 0.0409 |
Weighted residual factors for significantly intense reflections | 0.098 |
Weighted residual factors for all reflections included in the refinement | 0.1046 |
Goodness-of-fit parameter for all reflections included in the refinement | 1.051 |
Diffraction radiation wavelength | 0.7107 Å |
Diffraction radiation type | MoKα |