Information card for entry 7035618
Formula | C12 H41 Ga4 N4 O38 P7 |
Calculated formula | C12 H36 Ga4 N4 O38 P7 |
Title of publication | Solvent-free synthesis of new metal phosphate-oxalates: influence of different metal ions on the framework structures. |
Authors of publication | Luan, Lindong; Yang, Meng; Bian, Yixuan; Lin, Zhien; Huang, Hui |
Journal of publication | Dalton transactions (Cambridge, England : 2003) |
Year of publication | 2015 |
Journal volume | 44 |
Journal issue | 30 |
Pages of publication | 13485 - 13489 |
a | 6.21517 ± 0.00005 Å |
b | 18.83913 ± 0.00015 Å |
c | 16.65678 ± 0.00013 Å |
α | 90° |
β | 92.2293 ± 0.0007° |
γ | 90° |
Cell volume | 1948.84 ± 0.03 Å3 |
Cell temperature | 293 K |
Ambient diffraction temperature | 293 K |
Number of distinct elements | 6 |
Space group number | 14 |
Hermann-Mauguin space group symbol | P 1 21/n 1 |
Hall space group symbol | -P 2yn |
Residual factor for all reflections | 0.0516 |
Residual factor for significantly intense reflections | 0.05 |
Weighted residual factors for significantly intense reflections | 0.1352 |
Weighted residual factors for all reflections included in the refinement | 0.1377 |
Goodness-of-fit parameter for all reflections included in the refinement | 1.056 |
Diffraction radiation probe | x-ray |
Diffraction radiation wavelength | 1.54184 Å |
Diffraction radiation type | CuKα |