Information card for entry 7057082
Formula | C18 H38 Co3 N4 O20 P4 |
Calculated formula | C18 H38 Co3 N4 O20 P4 |
Title of publication | 1D Co(ii) coordination polymers based on cyclobutyl- and cyclopentyl-substituted zoledronate analogues: synthesis, structural comparison, thermal stability and magnetic properties |
Authors of publication | Rojek, Tomasz; Goldeman, Waldemar; Ślepokura, Katarzyna; Duczmal, Marek; Wojciechowska, Agnieszka; Matczak-Jon, Ewa |
Journal of publication | New Journal of Chemistry |
Year of publication | 2018 |
Journal volume | 42 |
Journal issue | 10 |
Pages of publication | 7830 |
a | 7.9658 ± 0.0017 Å |
b | 9.4269 ± 0.0019 Å |
c | 9.9867 ± 0.0019 Å |
α | 92.69 ± 0.05° |
β | 95.66 ± 0.05° |
γ | 101.35 ± 0.05° |
Cell volume | 730 ± 0.3 Å3 |
Cell temperature | 100 ± 2 K |
Ambient diffraction temperature | 100 ± 2 K |
Number of distinct elements | 6 |
Space group number | 2 |
Hermann-Mauguin space group symbol | P -1 |
Hall space group symbol | -P 1 |
Residual factor for all reflections | 0.0533 |
Residual factor for significantly intense reflections | 0.0381 |
Weighted residual factors for significantly intense reflections | 0.0842 |
Weighted residual factors for all reflections included in the refinement | 0.0903 |
Goodness-of-fit parameter for all reflections included in the refinement | 1.037 |
Diffraction radiation wavelength | 0.71073 Å |
Diffraction radiation type | MoKα |