Information card for entry 7057144
Formula | C50 H62 N11 |
Calculated formula | C50 H62 N11 |
Title of publication | Synthesis of novel series of 7,7′-(substituted methylene)bis-imidazo[1,2-b]pyrazoles via an acid catalyzed one-pot three-component reaction |
Authors of publication | Driowya, Mohsine; Allouchi, Hassan; Gally, José Manuel; Bonnet, Pascal; Guillaumet, Gérald |
Journal of publication | New Journal of Chemistry |
Year of publication | 2018 |
Journal volume | 42 |
Journal issue | 8 |
Pages of publication | 5728 |
a | 24.6041 ± 0.0016 Å |
b | 6.049 ± 0.0007 Å |
c | 31.305 ± 0.003 Å |
α | 90° |
β | 92.106 ± 0.006° |
γ | 90° |
Cell volume | 4656 ± 0.8 Å3 |
Cell temperature | 170 ± 2 K |
Ambient diffraction temperature | 170 ± 2 K |
Number of distinct elements | 3 |
Space group number | 14 |
Hermann-Mauguin space group symbol | P 1 21/n 1 |
Hall space group symbol | -P 2yn |
Residual factor for all reflections | 0.1463 |
Residual factor for significantly intense reflections | 0.0731 |
Weighted residual factors for significantly intense reflections | 0.1666 |
Weighted residual factors for all reflections included in the refinement | 0.2154 |
Goodness-of-fit parameter for all reflections included in the refinement | 0.993 |
Diffraction radiation wavelength | 0.71073 Å |
Diffraction radiation type | MoKα |