Information card for entry 7057145
Formula | C29 H31 Cd N5 O5 |
Calculated formula | C29 H24 Cd N5 O5 |
Title of publication | Exploring the multifunctionality in metal‒organic framework materials: how do the stilbenedicarboxylate and imidazolyl ligands tune the characteristics of coordination polymers? |
Authors of publication | Barsukova, Marina O.; Sapchenko, Sergey A.; Kovalenko, Konstantin A.; Samsonenko, Denis G.; Potapov, Andrei S.; Dybtsev, Danil N.; Fedin, Vladimir P. |
Journal of publication | New Journal of Chemistry |
Year of publication | 2018 |
Journal volume | 42 |
Journal issue | 8 |
Pages of publication | 6408 |
a | 11.2374 ± 0.0003 Å |
b | 6.78252 ± 0.00013 Å |
c | 18.7482 ± 0.0004 Å |
α | 90° |
β | 91.4013 ± 0.0019° |
γ | 90° |
Cell volume | 1428.52 ± 0.06 Å3 |
Cell temperature | 130 ± 2 K |
Ambient diffraction temperature | 130 ± 2 K |
Number of distinct elements | 5 |
Space group number | 13 |
Hermann-Mauguin space group symbol | P 1 2/c 1 |
Hall space group symbol | -P 2yc |
Residual factor for all reflections | 0.0338 |
Residual factor for significantly intense reflections | 0.026 |
Weighted residual factors for significantly intense reflections | 0.0609 |
Weighted residual factors for all reflections included in the refinement | 0.0641 |
Goodness-of-fit parameter for all reflections included in the refinement | 1.101 |
Diffraction radiation probe | x-ray |
Diffraction radiation wavelength | 0.71073 Å |
Diffraction radiation type | MoKα |