Information card for entry 7057182
Formula | C34 H23.33 N2 O12 Ru3 |
Calculated formula | C34 H23.3333 N2 O12 Ru3 |
Title of publication | Ruthenium carbonyl complexes with pyridylalkanol ligands: synthesis, characterization and catalytic properties for aerobic oxidation of secondary alcohols |
Authors of publication | Hao, Zhiqiang; Li, Ning; Yan, Xinlong; Li, Ying; Zong, Siqi; Liu, Huating; Han, Zhangang; Lin, Jin |
Journal of publication | New Journal of Chemistry |
Year of publication | 2018 |
Journal volume | 42 |
Journal issue | 9 |
Pages of publication | 6968 |
a | 37.38 ± 0.003 Å |
b | 11.631 ± 0.0011 Å |
c | 14.8401 ± 0.0012 Å |
α | 90° |
β | 94.398 ± 0.001° |
γ | 90° |
Cell volume | 6433 ± 1 Å3 |
Cell temperature | 298 ± 2 K |
Ambient diffraction temperature | 298 ± 2 K |
Number of distinct elements | 5 |
Space group number | 5 |
Hermann-Mauguin space group symbol | C 1 2 1 |
Hall space group symbol | C 2y |
Residual factor for all reflections | 0.1602 |
Residual factor for significantly intense reflections | 0.0775 |
Weighted residual factors for significantly intense reflections | 0.1711 |
Weighted residual factors for all reflections included in the refinement | 0.1839 |
Goodness-of-fit parameter for all reflections included in the refinement | 1.083 |
Diffraction radiation wavelength | 0.71073 Å |
Diffraction radiation type | MoKα |