Information card for entry 7057339
Common name | nickel(II) nitroplatinate octahydrate |
Formula | H16 N4 Ni O16 Pt |
Calculated formula | H16 N4 Ni O16 Pt |
Title of publication | Complex salts of Pd(ii) and Pt(ii) with Co(ii) and Ni(ii) aqua-cations as single-source precursors for bimetallic nanoalloys and mixed oxides |
Authors of publication | Zadesenets, Andrey V.; Filatov, Evgeniy Yu.; Plyusnin, Pavel E.; Asanova, Tatyana I.; Korolkov, Ilya V.; Baidina, Iraida A.; Shlyakhova, Elena V.; Asanov, Igor P.; Korenev, Sergey V. |
Journal of publication | New Journal of Chemistry |
Year of publication | 2018 |
Journal volume | 42 |
Journal issue | 11 |
Pages of publication | 8843 |
a | 5.9377 ± 0.0004 Å |
b | 7.7854 ± 0.0005 Å |
c | 8.7147 ± 0.0005 Å |
α | 110.031 ± 0.003° |
β | 104.303 ± 0.003° |
γ | 96.242 ± 0.003° |
Cell volume | 358.39 ± 0.04 Å3 |
Cell temperature | 296 ± 2 K |
Ambient diffraction temperature | 296 ± 2 K |
Number of distinct elements | 5 |
Space group number | 1 |
Hermann-Mauguin space group symbol | P 1 |
Hall space group symbol | P 1 |
Residual factor for all reflections | 0.0148 |
Residual factor for significantly intense reflections | 0.0148 |
Weighted residual factors for significantly intense reflections | 0.0346 |
Weighted residual factors for all reflections included in the refinement | 0.0346 |
Goodness-of-fit parameter for all reflections included in the refinement | 1.039 |
Diffraction radiation wavelength | 0.71073 Å |
Diffraction radiation type | MoKα |