Information card for entry 7057340
Common name | cobalt(II) nitroplatinate octahydrate |
Chemical name | hexaaquacobalt(II) tetranitroplatinate(II) dihydrate |
Formula | Co H16 N4 O16 Pt |
Calculated formula | Co H16 N4 O16 Pt |
Title of publication | Complex salts of Pd(ii) and Pt(ii) with Co(ii) and Ni(ii) aqua-cations as single-source precursors for bimetallic nanoalloys and mixed oxides |
Authors of publication | Zadesenets, Andrey V.; Filatov, Evgeniy Yu.; Plyusnin, Pavel E.; Asanova, Tatyana I.; Korolkov, Ilya V.; Baidina, Iraida A.; Shlyakhova, Elena V.; Asanov, Igor P.; Korenev, Sergey V. |
Journal of publication | New Journal of Chemistry |
Year of publication | 2018 |
Journal volume | 42 |
Journal issue | 11 |
Pages of publication | 8843 |
a | 5.9125 ± 0.0004 Å |
b | 7.8201 ± 0.0005 Å |
c | 8.7149 ± 0.0006 Å |
α | 110.076 ± 0.003° |
β | 103.908 ± 0.003° |
γ | 96.272 ± 0.003° |
Cell volume | 359.15 ± 0.04 Å3 |
Cell temperature | 150 ± 2 K |
Ambient diffraction temperature | 150 ± 2 K |
Number of distinct elements | 5 |
Space group number | 1 |
Hermann-Mauguin space group symbol | P 1 |
Hall space group symbol | P 1 |
Residual factor for all reflections | 0.0162 |
Residual factor for significantly intense reflections | 0.0162 |
Weighted residual factors for significantly intense reflections | 0.0454 |
Weighted residual factors for all reflections included in the refinement | 0.0454 |
Goodness-of-fit parameter for all reflections included in the refinement | 1.092 |
Diffraction radiation wavelength | 0.71073 Å |
Diffraction radiation type | MoKα |