Information card for entry 7057341
Common name | nickel(II) nitropalladate octahydrate |
Chemical name | hexaaquanickel(II) tetranitropalladate(II) dihydrate |
Formula | H16 N4 Ni O16 Pd |
Calculated formula | H16 N4 Ni O16 Pd |
Title of publication | Complex salts of Pd(ii) and Pt(ii) with Co(ii) and Ni(ii) aqua-cations as single-source precursors for bimetallic nanoalloys and mixed oxides |
Authors of publication | Zadesenets, Andrey V.; Filatov, Evgeniy Yu.; Plyusnin, Pavel E.; Asanova, Tatyana I.; Korolkov, Ilya V.; Baidina, Iraida A.; Shlyakhova, Elena V.; Asanov, Igor P.; Korenev, Sergey V. |
Journal of publication | New Journal of Chemistry |
Year of publication | 2018 |
Journal volume | 42 |
Journal issue | 11 |
Pages of publication | 8843 |
a | 5.9834 ± 0.0002 Å |
b | 7.8788 ± 0.0003 Å |
c | 8.6406 ± 0.0003 Å |
α | 110.211 ± 0.002° |
β | 105.344 ± 0.002° |
γ | 95.988 ± 0.002° |
Cell volume | 359.9 ± 0.02 Å3 |
Cell temperature | 296 ± 2 K |
Ambient diffraction temperature | 296 ± 2 K |
Number of distinct elements | 5 |
Space group number | 1 |
Hermann-Mauguin space group symbol | P 1 |
Hall space group symbol | P 1 |
Residual factor for all reflections | 0.0229 |
Residual factor for significantly intense reflections | 0.0212 |
Weighted residual factors for significantly intense reflections | 0.0497 |
Weighted residual factors for all reflections included in the refinement | 0.0505 |
Goodness-of-fit parameter for all reflections included in the refinement | 1.101 |
Diffraction radiation wavelength | 0.71073 Å |
Diffraction radiation type | MoKα |