Information card for entry 7058793
Common name | Eustpyttfa3 |
Formula | C43 H25 Eu F9 N3 O6 S4 |
Calculated formula | C43 H25 Eu F9 N3 O6 S4 |
Title of publication | Luminescent europium(iii) and terbium(iii) complexes of β-diketonate and substituted terpyridine ligands: synthesis, crystal structures and elucidation of energy transfer pathways |
Authors of publication | Abbas, Zafar; Dasari, Srikanth; Beltrán-Leiva, María J.; Cantero-López, Plinio; Páez-Hernández, Dayán; Arratia-Pérez, Ramiro; Butcher, Ray J.; Patra, Ashis K. |
Journal of publication | New Journal of Chemistry |
Year of publication | 2019 |
Journal volume | 43 |
Journal issue | 38 |
Pages of publication | 15139 |
a | 9.8 ± 0.001 Å |
b | 12.3863 ± 0.0012 Å |
c | 19.76 ± 0.002 Å |
α | 88.046 ± 0.002° |
β | 79.892 ± 0.002° |
γ | 69.878 ± 0.002° |
Cell volume | 2216.3 ± 0.4 Å3 |
Cell temperature | 100 ± 2 K |
Ambient diffraction temperature | 100 ± 2 K |
Number of distinct elements | 7 |
Space group number | 2 |
Hermann-Mauguin space group symbol | P -1 |
Hall space group symbol | -P 1 |
Residual factor for all reflections | 0.127 |
Residual factor for significantly intense reflections | 0.0796 |
Weighted residual factors for significantly intense reflections | 0.1814 |
Weighted residual factors for all reflections included in the refinement | 0.2065 |
Goodness-of-fit parameter for all reflections included in the refinement | 1.054 |
Diffraction radiation wavelength | 0.71073 Å |
Diffraction radiation type | MoKα |