Information card for entry 7216041
Formula | C8 H18 Mn O10 P2 |
Calculated formula | C8 H14 Mn O10 P2 |
Title of publication | Tuning the structure of metal phosphonates using uncoordinating methyl group: syntheses, structures and properties of a series of metal diphosphonates |
Authors of publication | Tang, Si-Fu; Li, Liang-Jun; Lv, Xiao-Xia; Wang, Chao; Zhao, Xue-Bo |
Journal of publication | CrystEngComm |
Year of publication | 2014 |
Journal volume | 16 |
Journal issue | 30 |
Pages of publication | 7043 |
a | 18.825 ± 0.004 Å |
b | 8.3912 ± 0.0016 Å |
c | 9.2901 ± 0.0018 Å |
α | 90° |
β | 94.064 ± 0.003° |
γ | 90° |
Cell volume | 1463.8 ± 0.5 Å3 |
Cell temperature | 293 ± 2 K |
Ambient diffraction temperature | 293 ± 2 K |
Number of distinct elements | 5 |
Space group number | 15 |
Hermann-Mauguin space group symbol | C 1 2/c 1 |
Hall space group symbol | -C 2yc |
Residual factor for all reflections | 0.0385 |
Residual factor for significantly intense reflections | 0.0355 |
Weighted residual factors for significantly intense reflections | 0.0941 |
Weighted residual factors for all reflections included in the refinement | 0.0963 |
Goodness-of-fit parameter for all reflections included in the refinement | 1.093 |
Diffraction radiation wavelength | 0.71073 Å |
Diffraction radiation type | MoKα |