Information card for entry 7216042
Formula | C8 H26 Co O14 P2 |
Calculated formula | C8 H26 Co O14 P2 |
Title of publication | Tuning the structure of metal phosphonates using uncoordinating methyl group: syntheses, structures and properties of a series of metal diphosphonates |
Authors of publication | Tang, Si-Fu; Li, Liang-Jun; Lv, Xiao-Xia; Wang, Chao; Zhao, Xue-Bo |
Journal of publication | CrystEngComm |
Year of publication | 2014 |
Journal volume | 16 |
Journal issue | 30 |
Pages of publication | 7043 |
a | 6.8159 ± 0.0018 Å |
b | 9.734 ± 0.003 Å |
c | 13.799 ± 0.004 Å |
α | 96.523 ± 0.004° |
β | 95.78 ± 0.004° |
γ | 91.06 ± 0.004° |
Cell volume | 904.5 ± 0.5 Å3 |
Cell temperature | 296 ± 2 K |
Ambient diffraction temperature | 296 ± 2 K |
Number of distinct elements | 5 |
Space group number | 2 |
Hermann-Mauguin space group symbol | P -1 |
Hall space group symbol | -P 1 |
Residual factor for all reflections | 0.0592 |
Residual factor for significantly intense reflections | 0.0456 |
Weighted residual factors for significantly intense reflections | 0.1124 |
Weighted residual factors for all reflections included in the refinement | 0.1208 |
Goodness-of-fit parameter for all reflections included in the refinement | 1.041 |
Diffraction radiation wavelength | 0.71073 Å |
Diffraction radiation type | MoKα |