Information card for entry 7220389
Formula | C7 H8 Cd N O7 |
Calculated formula | C6 H8 Cd N2 O7 |
Title of publication | Construction of variable dimensional cadmium(ii) coordination polymers from pyridine-2,3-dicarboxylic acid |
Authors of publication | Yin, Wen-Xia; Liu, Yi-Ting; Ding, Yu-Jia; Lin, Qiang; Lin, Xiao-Ming; Wu, Chun-Lei; Yao, Xiang-Dong; Cai, Yue-Peng |
Journal of publication | CrystEngComm |
Year of publication | 2015 |
Journal volume | 17 |
Journal issue | 19 |
Pages of publication | 3619 |
a | 21.032 ± 0.002 Å |
b | 7.9734 ± 0.0008 Å |
c | 12.5404 ± 0.0013 Å |
α | 90° |
β | 110.192 ± 0.001° |
γ | 90° |
Cell volume | 1973.7 ± 0.3 Å3 |
Cell temperature | 296 ± 2 K |
Ambient diffraction temperature | 296 ± 2 K |
Number of distinct elements | 5 |
Space group number | 15 |
Hermann-Mauguin space group symbol | C 1 2/c 1 |
Hall space group symbol | -C 2yc |
Residual factor for all reflections | 0.0223 |
Residual factor for significantly intense reflections | 0.0209 |
Weighted residual factors for significantly intense reflections | 0.0534 |
Weighted residual factors for all reflections included in the refinement | 0.0543 |
Goodness-of-fit parameter for all reflections included in the refinement | 0.982 |
Diffraction radiation wavelength | 0.71073 Å |
Diffraction radiation type | MoKα |