Information card for entry 7220677
Formula | C90 H76 Co3 N18 O24 |
Calculated formula | C90 H64 Co3 N18 O24 |
Title of publication | Structural diversity of five coordination polymers based on 2,6-bis(3,5-dicarboxyphenyl)pyridine ligand: solvothermal syntheses, structural characterizations, and magnetic properties |
Authors of publication | Fan, Liming; Fan, Weiliu; Li, Bin; Liu, Xinzheng; Zhao, Xian; Zhang, Xiutang |
Journal of publication | CrystEngComm |
Year of publication | 2015 |
Journal volume | 17 |
Journal issue | 25 |
Pages of publication | 4669 |
a | 24.5299 ± 0.0012 Å |
b | 12.3443 ± 0.0006 Å |
c | 31.5597 ± 0.0015 Å |
α | 90° |
β | 100.337 ± 0.001° |
γ | 90° |
Cell volume | 9401.3 ± 0.8 Å3 |
Cell temperature | 296 ± 2 K |
Ambient diffraction temperature | 296.15 K |
Number of distinct elements | 5 |
Space group number | 15 |
Hermann-Mauguin space group symbol | C 1 2/c 1 |
Hall space group symbol | -C 2yc |
Residual factor for all reflections | 0.0682 |
Residual factor for significantly intense reflections | 0.0549 |
Weighted residual factors for significantly intense reflections | 0.1671 |
Weighted residual factors for all reflections included in the refinement | 0.1804 |
Goodness-of-fit parameter for all reflections included in the refinement | 1.107 |
Diffraction radiation wavelength | 0.71073 Å |
Diffraction radiation type | MoKα |