Information card for entry 7220812
Formula | C9 H13 Gd N4 O9 |
Calculated formula | C9 H13 Gd N4 O9 |
Title of publication | Lanthanide coordination polymers constructed from 5-(1H-tetrazol-5-yl)isophthalic acid ligand: white light emission and color tuning |
Authors of publication | Jia, Jia; Xu, Jianing; Wang, Shengyan; Wang, Pengcheng; Gao, Lijuan; Yu, Miao; Fan, Yong; Wang, Li |
Journal of publication | CrystEngComm |
Year of publication | 2015 |
Journal volume | 17 |
Journal issue | 31 |
Pages of publication | 6030 |
a | 7.9767 ± 0.0005 Å |
b | 9.7325 ± 0.0005 Å |
c | 10.3966 ± 0.0006 Å |
α | 116.821 ± 0.001° |
β | 107.333 ± 0.001° |
γ | 95.669 ± 0.001° |
Cell volume | 661.32 ± 0.07 Å3 |
Cell temperature | 296 ± 2 K |
Ambient diffraction temperature | 296 ± 2 K |
Number of distinct elements | 5 |
Space group number | 2 |
Hermann-Mauguin space group symbol | P -1 |
Hall space group symbol | -P 1 |
Residual factor for all reflections | 0.0295 |
Residual factor for significantly intense reflections | 0.0284 |
Weighted residual factors for significantly intense reflections | 0.0746 |
Weighted residual factors for all reflections included in the refinement | 0.0754 |
Goodness-of-fit parameter for all reflections included in the refinement | 1.038 |
Diffraction radiation wavelength | 0.71073 Å |
Diffraction radiation type | MoKα |