Information card for entry 7221794
Formula | C26 H24 Cl0 Co N4 O11 |
Calculated formula | C26 H24 Co N4 O11 |
Title of publication | Polycarboxylate-directed various Co(ii) complexes based on a “V”-like bis-pyridyl-bis-amide derivative: construction, electrochemical and photocatalytic properties |
Authors of publication | Wang, Xiu-Li; Sha, Xiao-Ting; Liu, Guo-Cheng; Chen, Nai-Li; Tian, Yuan |
Journal of publication | CrystEngComm |
Year of publication | 2015 |
Journal volume | 17 |
Journal issue | 38 |
Pages of publication | 7290 |
a | 10.0129 ± 0.0019 Å |
b | 10.724 ± 0.002 Å |
c | 13.961 ± 0.003 Å |
α | 73.385 ± 0.003° |
β | 73.609 ± 0.004° |
γ | 64.888 ± 0.003° |
Cell volume | 1278.2 ± 0.4 Å3 |
Cell temperature | 296 ± 2 K |
Ambient diffraction temperature | 296 ± 2 K |
Number of distinct elements | 6 |
Space group number | 2 |
Hermann-Mauguin space group symbol | P -1 |
Hall space group symbol | -P 1 |
Residual factor for all reflections | 0.0872 |
Residual factor for significantly intense reflections | 0.0685 |
Weighted residual factors for significantly intense reflections | 0.1969 |
Weighted residual factors for all reflections included in the refinement | 0.2136 |
Goodness-of-fit parameter for all reflections included in the refinement | 1 |
Diffraction radiation wavelength | 0.71073 Å |
Diffraction radiation type | MoKα |