Information card for entry 7221795
Formula | C27 H24 Cl0 Co N4 O9 |
Calculated formula | C27 H22 Co N4 O9 |
Title of publication | Polycarboxylate-directed various Co(ii) complexes based on a “V”-like bis-pyridyl-bis-amide derivative: construction, electrochemical and photocatalytic properties |
Authors of publication | Wang, Xiu-Li; Sha, Xiao-Ting; Liu, Guo-Cheng; Chen, Nai-Li; Tian, Yuan |
Journal of publication | CrystEngComm |
Year of publication | 2015 |
Journal volume | 17 |
Journal issue | 38 |
Pages of publication | 7290 |
a | 9.9555 ± 0.0006 Å |
b | 16.481 ± 0.001 Å |
c | 16.1393 ± 0.001 Å |
α | 90° |
β | 100.673 ± 0.001° |
γ | 90° |
Cell volume | 2602.3 ± 0.3 Å3 |
Cell temperature | 296 ± 2 K |
Ambient diffraction temperature | 296 ± 2 K |
Number of distinct elements | 6 |
Space group number | 14 |
Hermann-Mauguin space group symbol | P 1 21/c 1 |
Hall space group symbol | -P 2ybc |
Residual factor for all reflections | 0.055 |
Residual factor for significantly intense reflections | 0.0385 |
Weighted residual factors for significantly intense reflections | 0.0986 |
Weighted residual factors for all reflections included in the refinement | 0.1077 |
Goodness-of-fit parameter for all reflections included in the refinement | 1 |
Diffraction radiation wavelength | 0.71073 Å |
Diffraction radiation type | MoKα |