Information card for entry 7222264
Formula | C28 H18 Cd2 F8 N4 O8 |
Calculated formula | C28 H18 Cd2 F8 N4 O8 |
Title of publication | A series of reaction-controlled coordination polymers constructed from bis(imidazole) and tetrafluoroterephthalic acid ligands: syntheses, structural diversities, properties |
Authors of publication | Li, Xiu-Yuan; Liu, Meng; Yue, Ke-Fen; Wu, Ya-Pan; He, Tian; Yan, Ni; Wang, Yao-Yu |
Journal of publication | CrystEngComm |
Year of publication | 2015 |
Journal volume | 17 |
Journal issue | 43 |
Pages of publication | 8273 |
a | 20.28 ± 0.003 Å |
b | 7.5025 ± 0.0012 Å |
c | 20.478 ± 0.003 Å |
α | 90° |
β | 99.022 ± 0.003° |
γ | 90° |
Cell volume | 3077.2 ± 0.8 Å3 |
Cell temperature | 296 ± 2 K |
Ambient diffraction temperature | 296 ± 2 K |
Number of distinct elements | 6 |
Space group number | 14 |
Hermann-Mauguin space group symbol | P 1 21/n 1 |
Hall space group symbol | -P 2yn |
Residual factor for all reflections | 0.0967 |
Residual factor for significantly intense reflections | 0.0841 |
Weighted residual factors for significantly intense reflections | 0.2181 |
Weighted residual factors for all reflections included in the refinement | 0.2236 |
Goodness-of-fit parameter for all reflections included in the refinement | 1.1 |
Diffraction radiation wavelength | 0.71073 Å |
Diffraction radiation type | MoKα |