Information card for entry 7222265
Formula | C20 H18 F4 N4 Ni O4 |
Calculated formula | C20 H18 F4 N4 Ni O4 |
Title of publication | A series of reaction-controlled coordination polymers constructed from bis(imidazole) and tetrafluoroterephthalic acid ligands: syntheses, structural diversities, properties |
Authors of publication | Li, Xiu-Yuan; Liu, Meng; Yue, Ke-Fen; Wu, Ya-Pan; He, Tian; Yan, Ni; Wang, Yao-Yu |
Journal of publication | CrystEngComm |
Year of publication | 2015 |
Journal volume | 17 |
Journal issue | 43 |
Pages of publication | 8273 |
a | 10.102 ± 0.0018 Å |
b | 9.3434 ± 0.0017 Å |
c | 11.929 ± 0.002 Å |
α | 90° |
β | 91.259 ± 0.003° |
γ | 90° |
Cell volume | 1125.7 ± 0.3 Å3 |
Cell temperature | 296 ± 2 K |
Ambient diffraction temperature | 296 ± 2 K |
Number of distinct elements | 6 |
Space group number | 13 |
Hermann-Mauguin space group symbol | P 1 2/n 1 |
Hall space group symbol | -P 2yac |
Residual factor for all reflections | 0.0604 |
Residual factor for significantly intense reflections | 0.0541 |
Weighted residual factors for significantly intense reflections | 0.156 |
Weighted residual factors for all reflections included in the refinement | 0.1607 |
Goodness-of-fit parameter for all reflections included in the refinement | 1.073 |
Diffraction radiation wavelength | 0.71073 Å |
Diffraction radiation type | MoKα |