Information card for entry 7223052
Formula | C36 H26 Cu N4 O8 |
Calculated formula | C36 H26 Cu N4 O8 |
Title of publication | Coligand syntheses, crystal structures, luminescence and photocatalytic properties of five coordination polymers based on rigid tetracarboxylic acids and imidazole linkers |
Authors of publication | Fan, Liming; Fan, Weiliu; Li, Bin; Zhao, Xian; Zhang, Xiutang |
Journal of publication | CrystEngComm |
Year of publication | 2015 |
Journal volume | 17 |
Journal issue | 48 |
Pages of publication | 9413 |
a | 24.15 ± 0.02 Å |
b | 14.463 ± 0.013 Å |
c | 8.914 ± 0.008 Å |
α | 90° |
β | 90.251 ± 0.016° |
γ | 90° |
Cell volume | 3113 ± 5 Å3 |
Cell temperature | 298 ± 2 K |
Ambient diffraction temperature | 298 ± 2 K |
Number of distinct elements | 5 |
Space group number | 15 |
Hermann-Mauguin space group symbol | C 1 2/c 1 |
Hall space group symbol | -C 2yc |
Residual factor for all reflections | 0.0914 |
Residual factor for significantly intense reflections | 0.0672 |
Weighted residual factors for significantly intense reflections | 0.1812 |
Weighted residual factors for all reflections included in the refinement | 0.2004 |
Goodness-of-fit parameter for all reflections included in the refinement | 1.037 |
Diffraction radiation wavelength | 0.71073 Å |
Diffraction radiation type | MoKα |