Information card for entry 7223196
Formula | C16 H33 Mg4 N4 O30 P3 |
Calculated formula | C16 H33 Mg4 N4 O30 P3 |
Title of publication | Solvent-free synthesis of new magnesium phosphate‒oxalates displaying diverse framework topologies |
Authors of publication | Zhang, Wei; Kang, Maoping; Yang, Meng; Luo, Daibing; Lin, Zhien |
Journal of publication | CrystEngComm |
Year of publication | 2015 |
Journal volume | 17 |
Journal issue | 48 |
Pages of publication | 9296 |
a | 7.7738 ± 0.0003 Å |
b | 9.484 ± 0.0003 Å |
c | 11.9243 ± 0.0005 Å |
α | 78.102 ± 0.003° |
β | 78.574 ± 0.004° |
γ | 86.183 ± 0.003° |
Cell volume | 842.9 ± 0.06 Å3 |
Cell temperature | 293.15 K |
Ambient diffraction temperature | 293.15 K |
Number of distinct elements | 6 |
Space group number | 1 |
Hermann-Mauguin space group symbol | P 1 |
Hall space group symbol | P 1 |
Residual factor for all reflections | 0.048 |
Residual factor for significantly intense reflections | 0.0473 |
Weighted residual factors for significantly intense reflections | 0.1243 |
Weighted residual factors for all reflections included in the refinement | 0.1257 |
Goodness-of-fit parameter for all reflections included in the refinement | 1.065 |
Diffraction radiation probe | x-ray |
Diffraction radiation wavelength | 1.54184 Å |
Diffraction radiation type | CuKα |