Information card for entry 7223389
Chemical name | 4-methoxysalicylaldehyde benzhydrazone |
Formula | C15 H14 N2 O3 |
Calculated formula | C15 H14 N2 O3 |
SMILES | O=C(N/N=C/c1ccc(OC)cc1O)c1ccccc1 |
Title of publication | Cobalt(III) complexes with tridentate hydrazone ligands: protonation state and hydrogen bonds competition |
Authors of publication | Vrdoljak, Visnja; Pavlović, Gordana; Hrenar, Tomica; Rubčić, Mirta; Siega, Patrizia; Dreos, Renata; Cindric, Marina |
Journal of publication | RSC Adv. |
Year of publication | 2015 |
a | 11.4472 ± 0.0006 Å |
b | 12.6502 ± 0.0009 Å |
c | 9.4907 ± 0.0005 Å |
α | 90° |
β | 97.657 ± 0.005° |
γ | 90° |
Cell volume | 1362.09 ± 0.14 Å3 |
Cell temperature | 296 ± 2 K |
Ambient diffraction temperature | 296 ± 2 K |
Number of distinct elements | 4 |
Space group number | 7 |
Hermann-Mauguin space group symbol | P 1 c 1 |
Hall space group symbol | P -2yc |
Residual factor for all reflections | 0.119 |
Residual factor for significantly intense reflections | 0.0644 |
Weighted residual factors for significantly intense reflections | 0.1456 |
Weighted residual factors for all reflections included in the refinement | 0.1735 |
Goodness-of-fit parameter for all reflections included in the refinement | 1 |
Diffraction radiation wavelength | 0.71073 Å |
Diffraction radiation type | MoKα |