Information card for entry 7236429
Formula | C36 H25 Cl2 N6 O Zn |
Calculated formula | C36 H28 Cl2 N6 O Zn |
Title of publication | A two-photon fluorescent RNA probe screened from a series of oxime-functionalized 2,2′:6′,2′′-terpyridine ZnX2(X = Cl, Br, I) complexes |
Authors of publication | Wang, Hui; Tian, Xiaohe; Du, Wei; Zhang, Qiong; Guan, Lijuan; Wang, Aidong; Zhang, Yujin; Wang, Chuankui; Zhou, Hongping; Wu, Jieying; Tian, Yupeng |
Journal of publication | Journal of Materials Chemistry B |
Year of publication | 2016 |
Journal volume | 4 |
Journal issue | 28 |
Pages of publication | 4818 |
a | 11.124 ± 0.005 Å |
b | 14.265 ± 0.005 Å |
c | 20.97 ± 0.005 Å |
α | 90 ± 0.005° |
β | 92.901 ± 0.005° |
γ | 90 ± 0.005° |
Cell volume | 3323 ± 2 Å3 |
Cell temperature | 298 ± 2 K |
Ambient diffraction temperature | 298 ± 2 K |
Number of distinct elements | 6 |
Space group number | 14 |
Hermann-Mauguin space group symbol | P 1 21/c 1 |
Hall space group symbol | -P 2ybc |
Residual factor for all reflections | 0.078 |
Residual factor for significantly intense reflections | 0.0491 |
Weighted residual factors for significantly intense reflections | 0.1409 |
Weighted residual factors for all reflections included in the refinement | 0.1632 |
Goodness-of-fit parameter for all reflections included in the refinement | 0.984 |
Diffraction radiation wavelength | 0.71069 Å |
Diffraction radiation type | MoKα |