Information card for entry 7236430
Formula | C138 H96 Cl4 I8 N22 O4 Zn4 |
Calculated formula | C138.064 H96 Cl4 I8 N22.16 O4 Zn4 |
Title of publication | A two-photon fluorescent RNA probe screened from a series of oxime-functionalized 2,2′:6′,2′′-terpyridine ZnX2(X = Cl, Br, I) complexes |
Authors of publication | Wang, Hui; Tian, Xiaohe; Du, Wei; Zhang, Qiong; Guan, Lijuan; Wang, Aidong; Zhang, Yujin; Wang, Chuankui; Zhou, Hongping; Wu, Jieying; Tian, Yupeng |
Journal of publication | Journal of Materials Chemistry B |
Year of publication | 2016 |
Journal volume | 4 |
Journal issue | 28 |
Pages of publication | 4818 |
a | 11.166 ± 0.004 Å |
b | 14.692 ± 0.005 Å |
c | 21.336 ± 0.008 Å |
α | 90° |
β | 91.616 ± 0.005° |
γ | 90° |
Cell volume | 3499 ± 2 Å3 |
Cell temperature | 296 ± 2 K |
Ambient diffraction temperature | 296 ± 2 K |
Number of distinct elements | 7 |
Space group number | 14 |
Hermann-Mauguin space group symbol | P 1 21/c 1 |
Hall space group symbol | -P 2ybc |
Residual factor for all reflections | 0.1968 |
Residual factor for significantly intense reflections | 0.0962 |
Weighted residual factors for significantly intense reflections | 0.2745 |
Weighted residual factors for all reflections included in the refinement | 0.3171 |
Goodness-of-fit parameter for all reflections included in the refinement | 1 |
Diffraction radiation wavelength | 0.71073 Å |
Diffraction radiation type | MoKα |