Information card for entry 7236431
Formula | C36 H27 Br2 N5 O Zn |
Calculated formula | C36 H27 Br2 N5 O Zn |
Title of publication | A two-photon fluorescent RNA probe screened from a series of oxime-functionalized 2,2′:6′,2′′-terpyridine ZnX2(X = Cl, Br, I) complexes |
Authors of publication | Wang, Hui; Tian, Xiaohe; Du, Wei; Zhang, Qiong; Guan, Lijuan; Wang, Aidong; Zhang, Yujin; Wang, Chuankui; Zhou, Hongping; Wu, Jieying; Tian, Yupeng |
Journal of publication | Journal of Materials Chemistry B |
Year of publication | 2016 |
Journal volume | 4 |
Journal issue | 28 |
Pages of publication | 4818 |
a | 11.759 ± 0.005 Å |
b | 12.636 ± 0.005 Å |
c | 13.141 ± 0.005 Å |
α | 100.106 ± 0.005° |
β | 103.238 ± 0.005° |
γ | 114.716 ± 0.005° |
Cell volume | 1643.4 ± 1.1 Å3 |
Cell temperature | 298 ± 2 K |
Ambient diffraction temperature | 298 ± 2 K |
Number of distinct elements | 6 |
Space group number | 2 |
Hermann-Mauguin space group symbol | P -1 |
Hall space group symbol | -P 1 |
Residual factor for all reflections | 0.0879 |
Residual factor for significantly intense reflections | 0.049 |
Weighted residual factors for significantly intense reflections | 0.1348 |
Weighted residual factors for all reflections included in the refinement | 0.1609 |
Goodness-of-fit parameter for all reflections included in the refinement | 0.963 |
Diffraction radiation wavelength | 0.71069 Å |
Diffraction radiation type | MoKα |