Information card for entry 7236432
Formula | C36 H27 Cl2 N5 O Zn |
Calculated formula | C36 H30 Cl2 N4 O2 Zn |
Title of publication | A two-photon fluorescent RNA probe screened from a series of oxime-functionalized 2,2′:6′,2′′-terpyridine ZnX2(X = Cl, Br, I) complexes |
Authors of publication | Wang, Hui; Tian, Xiaohe; Du, Wei; Zhang, Qiong; Guan, Lijuan; Wang, Aidong; Zhang, Yujin; Wang, Chuankui; Zhou, Hongping; Wu, Jieying; Tian, Yupeng |
Journal of publication | Journal of Materials Chemistry B |
Year of publication | 2016 |
Journal volume | 4 |
Journal issue | 28 |
Pages of publication | 4818 |
a | 14.796 ± 0.005 Å |
b | 14.776 ± 0.005 Å |
c | 16.532 ± 0.005 Å |
α | 90 ± 0.005° |
β | 114.555 ± 0.005° |
γ | 90 ± 0.005° |
Cell volume | 3287.5 ± 1.9 Å3 |
Cell temperature | 298 ± 2 K |
Ambient diffraction temperature | 298 ± 2 K |
Number of distinct elements | 6 |
Space group number | 14 |
Hermann-Mauguin space group symbol | P 1 21/n 1 |
Hall space group symbol | -P 2yn |
Residual factor for all reflections | 0.0729 |
Residual factor for significantly intense reflections | 0.0642 |
Weighted residual factors for significantly intense reflections | 0.2056 |
Weighted residual factors for all reflections included in the refinement | 0.2179 |
Goodness-of-fit parameter for all reflections included in the refinement | 1.011 |
Diffraction radiation wavelength | 0.71069 Å |
Diffraction radiation type | MoKα |