Information card for entry 7239663
Formula | C33 H20 N6 O8 Zn |
Calculated formula | C33 H20 N6 O8 Zn |
Title of publication | Three new coordination polymers based on bis(4-(4H-1,2,4-triazol-4-yl)phenyl)methane: syntheses, structures, multiresponsive luminescent sensitive detection for antibiotics and pesticides, and antitumor activities |
Authors of publication | Wang, Chang-Sheng; Huang, Qi; Wang, Xia; Zhang, Yu-Tong; Ma, Dong-Sheng; Yu, Ying-Hui; Gao, Jin-Sheng |
Journal of publication | RSC Advances |
Year of publication | 2019 |
Journal volume | 9 |
Journal issue | 72 |
Pages of publication | 42272 |
a | 9.6385 ± 0.0002 Å |
b | 12.8687 ± 0.0003 Å |
c | 13.4092 ± 0.0003 Å |
α | 71.818 ± 0.001° |
β | 75.224 ± 0.001° |
γ | 74.543 ± 0.001° |
Cell volume | 1495.94 ± 0.06 Å3 |
Cell temperature | 298 ± 2 K |
Ambient diffraction temperature | 298 ± 2 K |
Number of distinct elements | 5 |
Space group number | 2 |
Hermann-Mauguin space group symbol | P -1 |
Hall space group symbol | -P 1 |
Residual factor for all reflections | 0.0407 |
Residual factor for significantly intense reflections | 0.0333 |
Weighted residual factors for significantly intense reflections | 0.0887 |
Weighted residual factors for all reflections included in the refinement | 0.0933 |
Goodness-of-fit parameter for all reflections included in the refinement | 1.017 |
Diffraction radiation wavelength | 0.71073 Å |
Diffraction radiation type | MoKα |