Information card for entry 7242268
Formula | C64 H64 Cu4 Ge N16 O40 S16 W12 |
Calculated formula | C64 H64 Cu4 Ge N16 O40 S16 W12 |
Title of publication | Multifunctional photoelectric sensors and catalysts for CO2RR and Cr(vi) solution based on a series of POM-based materials |
Authors of publication | Wang, Chen; Ying, Jun; Zhang, Xin-yue; Zhang, Bao-yue; Tian, Ai-xiang; Wang, Xiu-li |
Journal of publication | CrystEngComm |
Year of publication | 2021 |
Journal volume | 23 |
Journal issue | 12 |
Pages of publication | 2424 - 2431 |
a | 14.0266 ± 0.001 Å |
b | 24.0079 ± 0.0016 Å |
c | 16.5999 ± 0.0012 Å |
α | 90° |
β | 100.791 ± 0.002° |
γ | 90° |
Cell volume | 5491.2 ± 0.7 Å3 |
Cell temperature | 296 ± 2 K |
Ambient diffraction temperature | 296.15 K |
Number of distinct elements | 8 |
Space group number | 14 |
Hermann-Mauguin space group symbol | P 1 21/n 1 |
Hall space group symbol | -P 2yn |
Residual factor for all reflections | 0.1851 |
Residual factor for significantly intense reflections | 0.0695 |
Weighted residual factors for significantly intense reflections | 0.1238 |
Weighted residual factors for all reflections included in the refinement | 0.161 |
Goodness-of-fit parameter for all reflections included in the refinement | 1.003 |
Diffraction radiation wavelength | 0.71073 Å |
Diffraction radiation type | MoKα |