Information card for entry 7242269
Formula | C64 H76 Co4 Ge2 N16 O86 S16 W24 |
Calculated formula | C64 H76 Co4 Ge2 N16 O86 S16 W24 |
Title of publication | Multifunctional photoelectric sensors and catalysts for CO2RR and Cr(vi) solution based on a series of POM-based materials |
Authors of publication | Wang, Chen; Ying, Jun; Zhang, Xin-yue; Zhang, Bao-yue; Tian, Ai-xiang; Wang, Xiu-li |
Journal of publication | CrystEngComm |
Year of publication | 2021 |
Journal volume | 23 |
Journal issue | 12 |
Pages of publication | 2424 - 2431 |
a | 12.374 ± 0.003 Å |
b | 15.539 ± 0.004 Å |
c | 19.761 ± 0.005 Å |
α | 86.897 ± 0.005° |
β | 87.383 ± 0.005° |
γ | 69.637 ± 0.005° |
Cell volume | 3555.5 ± 1.6 Å3 |
Cell temperature | 273 ± 2 K |
Ambient diffraction temperature | 273.15 K |
Number of distinct elements | 8 |
Space group number | 2 |
Hermann-Mauguin space group symbol | P -1 |
Hall space group symbol | -P 1 |
Residual factor for all reflections | 0.0942 |
Residual factor for significantly intense reflections | 0.0498 |
Weighted residual factors for significantly intense reflections | 0.0926 |
Weighted residual factors for all reflections included in the refinement | 0.1084 |
Goodness-of-fit parameter for all reflections included in the refinement | 0.958 |
Diffraction radiation wavelength | 0.71073 Å |
Diffraction radiation type | MoKα |