Information card for entry 7242270
Formula | C64 H76 Ge2 N16 Ni4 O86 S16 W24 |
Calculated formula | C64 H76 Ge2 N16 Ni4 O86 S16 W24 |
Title of publication | Multifunctional photoelectric sensors and catalysts for CO2RR and Cr(vi) solution based on a series of POM-based materials |
Authors of publication | Wang, Chen; Ying, Jun; Zhang, Xin-yue; Zhang, Bao-yue; Tian, Ai-xiang; Wang, Xiu-li |
Journal of publication | CrystEngComm |
Year of publication | 2021 |
Journal volume | 23 |
Journal issue | 12 |
Pages of publication | 2424 - 2431 |
a | 12.315 ± 0.003 Å |
b | 15.474 ± 0.004 Å |
c | 19.504 ± 0.005 Å |
α | 86.664 ± 0.005° |
β | 87.32 ± 0.005° |
γ | 69.631 ± 0.005° |
Cell volume | 3477 ± 1.5 Å3 |
Cell temperature | 273 ± 2 K |
Ambient diffraction temperature | 273.15 K |
Number of distinct elements | 8 |
Space group number | 2 |
Hermann-Mauguin space group symbol | P -1 |
Hall space group symbol | -P 1 |
Residual factor for all reflections | 0.1395 |
Residual factor for significantly intense reflections | 0.0565 |
Weighted residual factors for significantly intense reflections | 0.1007 |
Weighted residual factors for all reflections included in the refinement | 0.1282 |
Goodness-of-fit parameter for all reflections included in the refinement | 0.968 |
Diffraction radiation wavelength | 0.71073 Å |
Diffraction radiation type | MoKα |