Information card for entry 7244211
Formula | C10 H21 Cl F6 N5 P Ru |
Calculated formula | C10 H21 Cl F6 N5 P Ru |
Title of publication | Expanding and quantifying the crystal chemistry of the flexible ligand 15aneN5 |
Authors of publication | Shircliff, Anthony D.; Allbritton, Elisabeth M. A.; Davilla, Dustin J.; Gorbet, Michael-Joseph; Jones, Donald G.; Tresp, David S.; Allen, Michael B.; Shrestha, Alina; Burgess, Gwendolyn E.; Eze, John I.; Fernandez, Andrea T.; Ramirez, Daniel; Shoff, Kody J.; Crispin, Garet G.; Crone, Sarah B.; Flinn, Michael; Tran, Tien; Bryce, Darby S.; Bond, Abbagale L.; Shockey, Dylan W.; Oliver, Allen G.; Krause, Jeanette A.; Prior, Timothy J.; Hubin, Timothy J. |
Journal of publication | CrystEngComm |
Year of publication | 2022 |
Journal volume | 24 |
Journal issue | 6 |
Pages of publication | 1218 - 1236 |
a | 7.7456 ± 0.0007 Å |
b | 10.3834 ± 0.0009 Å |
c | 11.001 ± 0.001 Å |
α | 75.896 ± 0.002° |
β | 88.525 ± 0.002° |
γ | 85.227 ± 0.002° |
Cell volume | 855.1 ± 0.13 Å3 |
Cell temperature | 150 K |
Ambient diffraction temperature | 150 K |
Number of distinct elements | 7 |
Space group number | 2 |
Hermann-Mauguin space group symbol | P -1 |
Hall space group symbol | -P 1 |
Residual factor for all reflections | 0.0258 |
Residual factor for significantly intense reflections | 0.0235 |
Weighted residual factors for significantly intense reflections | 0.0604 |
Weighted residual factors for all reflections included in the refinement | 0.0618 |
Goodness-of-fit parameter for all reflections included in the refinement | 1.029 |
Diffraction radiation wavelength | 0.7749 Å |
Diffraction radiation type | synchrotron |