Information card for entry 7244213
Formula | C10 H28 Cl2 F6 N5 P |
Calculated formula | C10 H28 Cl2 F6 N5 P |
Title of publication | Expanding and quantifying the crystal chemistry of the flexible ligand 15aneN5 |
Authors of publication | Shircliff, Anthony D.; Allbritton, Elisabeth M. A.; Davilla, Dustin J.; Gorbet, Michael-Joseph; Jones, Donald G.; Tresp, David S.; Allen, Michael B.; Shrestha, Alina; Burgess, Gwendolyn E.; Eze, John I.; Fernandez, Andrea T.; Ramirez, Daniel; Shoff, Kody J.; Crispin, Garet G.; Crone, Sarah B.; Flinn, Michael; Tran, Tien; Bryce, Darby S.; Bond, Abbagale L.; Shockey, Dylan W.; Oliver, Allen G.; Krause, Jeanette A.; Prior, Timothy J.; Hubin, Timothy J. |
Journal of publication | CrystEngComm |
Year of publication | 2022 |
Journal volume | 24 |
Journal issue | 6 |
Pages of publication | 1218 - 1236 |
a | 18.619 ± 0.002 Å |
b | 9.6164 ± 0.0008 Å |
c | 11.7011 ± 0.001 Å |
α | 90° |
β | 110.806 ± 0.004° |
γ | 90° |
Cell volume | 1958.4 ± 0.3 Å3 |
Cell temperature | 150 K |
Ambient diffraction temperature | 150 K |
Number of distinct elements | 6 |
Space group number | 15 |
Hermann-Mauguin space group symbol | C 1 2/c 1 |
Hall space group symbol | -C 2yc |
Residual factor for all reflections | 0.0264 |
Residual factor for significantly intense reflections | 0.0245 |
Weighted residual factors for significantly intense reflections | 0.0652 |
Weighted residual factors for all reflections included in the refinement | 0.0664 |
Goodness-of-fit parameter for all reflections included in the refinement | 1.079 |
Diffraction radiation wavelength | 0.7749 Å |
Diffraction radiation type | synchrotron |