Information card for entry 7244214
Formula | C12 H31 Cu F12 N7 O4 P2 |
Calculated formula | C12 H31 Cu F12 N7 O4 P2 |
Title of publication | Expanding and quantifying the crystal chemistry of the flexible ligand 15aneN5 |
Authors of publication | Shircliff, Anthony D.; Allbritton, Elisabeth M. A.; Davilla, Dustin J.; Gorbet, Michael-Joseph; Jones, Donald G.; Tresp, David S.; Allen, Michael B.; Shrestha, Alina; Burgess, Gwendolyn E.; Eze, John I.; Fernandez, Andrea T.; Ramirez, Daniel; Shoff, Kody J.; Crispin, Garet G.; Crone, Sarah B.; Flinn, Michael; Tran, Tien; Bryce, Darby S.; Bond, Abbagale L.; Shockey, Dylan W.; Oliver, Allen G.; Krause, Jeanette A.; Prior, Timothy J.; Hubin, Timothy J. |
Journal of publication | CrystEngComm |
Year of publication | 2022 |
Journal volume | 24 |
Journal issue | 6 |
Pages of publication | 1218 - 1236 |
a | 8.2222 ± 0.0004 Å |
b | 12.5513 ± 0.0007 Å |
c | 12.9958 ± 0.0007 Å |
α | 90° |
β | 104.977 ± 0.002° |
γ | 90° |
Cell volume | 1295.6 ± 0.12 Å3 |
Cell temperature | 150 K |
Ambient diffraction temperature | 150 K |
Number of distinct elements | 7 |
Space group number | 4 |
Hermann-Mauguin space group symbol | P 1 21 1 |
Hall space group symbol | P 2yb |
Residual factor for all reflections | 0.036 |
Residual factor for significantly intense reflections | 0.0355 |
Weighted residual factors for significantly intense reflections | 0.0699 |
Weighted residual factors for all reflections included in the refinement | 0.0702 |
Goodness-of-fit parameter for all reflections included in the refinement | 1.12 |
Diffraction radiation wavelength | 0.7749 Å |
Diffraction radiation type | synchrotron |