Information card for entry 7244215
Formula | C13.76 H30.64 F6 Fe I0.12 N5 O3.76 P |
Calculated formula | C13.76 H30.64 F6 Fe I0.12 N5 O3.76 P |
Title of publication | Expanding and quantifying the crystal chemistry of the flexible ligand 15aneN5 |
Authors of publication | Shircliff, Anthony D.; Allbritton, Elisabeth M. A.; Davilla, Dustin J.; Gorbet, Michael-Joseph; Jones, Donald G.; Tresp, David S.; Allen, Michael B.; Shrestha, Alina; Burgess, Gwendolyn E.; Eze, John I.; Fernandez, Andrea T.; Ramirez, Daniel; Shoff, Kody J.; Crispin, Garet G.; Crone, Sarah B.; Flinn, Michael; Tran, Tien; Bryce, Darby S.; Bond, Abbagale L.; Shockey, Dylan W.; Oliver, Allen G.; Krause, Jeanette A.; Prior, Timothy J.; Hubin, Timothy J. |
Journal of publication | CrystEngComm |
Year of publication | 2022 |
Journal volume | 24 |
Journal issue | 6 |
Pages of publication | 1218 - 1236 |
a | 17.9648 ± 0.0014 Å |
b | 19.2765 ± 0.0014 Å |
c | 12.8235 ± 0.001 Å |
α | 90° |
β | 90° |
γ | 90° |
Cell volume | 4440.8 ± 0.6 Å3 |
Cell temperature | 150 K |
Ambient diffraction temperature | 150 ± 2 K |
Number of distinct elements | 8 |
Space group number | 64 |
Hermann-Mauguin space group symbol | C m c e |
Hall space group symbol | -C 2ac 2 |
Residual factor for all reflections | 0.064 |
Residual factor for significantly intense reflections | 0.0528 |
Weighted residual factors for significantly intense reflections | 0.1538 |
Weighted residual factors for all reflections included in the refinement | 0.1651 |
Goodness-of-fit parameter for all reflections included in the refinement | 1.033 |
Diffraction radiation wavelength | 0.7749 Å |
Diffraction radiation type | synchrotron |