Information card for entry 7247646
Formula | C24 H38 F6 N4 Ni O6 |
Calculated formula | C24 H38 F6 N4 Ni O6 |
Title of publication | Alternating [ML2(MeOH)2] and [ML2(EtOH)2] layers in low-temperature ferromagnets [ML2(MeOH)2][ML2(EtOH)2] (M = CoII, NiII or CoII0.5NiII0.5) |
Authors of publication | Ovcharenko, Victor; Fursova, Elena; Letyagin, Gleb; Morozov, Vitaly; Bogomyakov, Artem; Romanenko, Galina |
Journal of publication | CrystEngComm |
Year of publication | 2023 |
Journal volume | 25 |
Journal issue | 44 |
Pages of publication | 6194 - 6203 |
a | 9.9328 ± 0.0006 Å |
b | 15.9853 ± 0.0011 Å |
c | 11.4746 ± 0.0007 Å |
α | 90° |
β | 120.609 ± 0.003° |
γ | 90° |
Cell volume | 1568.06 ± 0.18 Å3 |
Cell temperature | 296 ± 2 K |
Ambient diffraction temperature | 296 ± 2 K |
Number of distinct elements | 6 |
Space group number | 14 |
Hermann-Mauguin space group symbol | P 1 21/c 1 |
Hall space group symbol | -P 2ybc |
Residual factor for all reflections | 0.0789 |
Residual factor for significantly intense reflections | 0.0428 |
Weighted residual factors for significantly intense reflections | 0.0898 |
Weighted residual factors for all reflections included in the refinement | 0.0975 |
Goodness-of-fit parameter for all reflections included in the refinement | 0.941 |
Diffraction radiation wavelength | 0.71073 Å |
Diffraction radiation type | MoKα |