Information card for entry 7700758
Common name | [AlMe2(N3Dmp2)] |
Formula | C52.5 H62 Al N3 |
Calculated formula | C52.5 H62 Al N3 |
Title of publication | Kinetic stabilization of low-oxidation state and terminal hydrido main group metal complexes by a sterically demanding N,N'-bis(2,6-terphenyl)triazenide. |
Authors of publication | Leverett, Anthony R.; Diachenko, Vera; Cole, Marcus L.; McKay, Alasdair I. |
Journal of publication | Dalton transactions (Cambridge, England : 2003) |
Year of publication | 2019 |
Journal volume | 48 |
Journal issue | 35 |
Pages of publication | 13197 - 13204 |
a | 10.7943 ± 0.0005 Å |
b | 11.7863 ± 0.0006 Å |
c | 19.6677 ± 0.0009 Å |
α | 98.246 ± 0.002° |
β | 96.521 ± 0.002° |
γ | 111.357 ± 0.002° |
Cell volume | 2268.68 ± 0.19 Å3 |
Cell temperature | 150 ± 2 K |
Ambient diffraction temperature | 150 K |
Number of distinct elements | 4 |
Space group number | 2 |
Hermann-Mauguin space group symbol | P -1 |
Hall space group symbol | -P 1 |
Residual factor for all reflections | 0.0654 |
Residual factor for significantly intense reflections | 0.052 |
Weighted residual factors for significantly intense reflections | 0.1435 |
Weighted residual factors for all reflections included in the refinement | 0.154 |
Goodness-of-fit parameter for all reflections included in the refinement | 1.016 |
Diffraction radiation wavelength | 0.71073 Å |
Diffraction radiation type | MoKα |