Information card for entry 7700998
Formula | C21 H76 Mo2 N14 O82 P2 W16 |
Calculated formula | C21 Mo2.329 N14 O68.3 P2 W15.671 |
Title of publication | A "directed precursor self-assembly" strategy for the facile synthesis of heteropoly blues: crystal structures, formation mechanism and electron distribution. |
Authors of publication | Wang, Yuchao; Li, Fengyan; Jiang, Ning; Liu, Xizheng; Xu, Lin |
Journal of publication | Dalton transactions (Cambridge, England : 2003) |
Year of publication | 2019 |
Journal volume | 48 |
Journal issue | 38 |
Pages of publication | 14347 - 14353 |
a | 14.946 Å |
b | 13.887 Å |
c | 21.17 Å |
α | 90° |
β | 92.02° |
γ | 90° |
Cell volume | 4391.21 Å3 |
Cell temperature | 293 ± 2 K |
Ambient diffraction temperature | 293 ± 2 K |
Number of distinct elements | 7 |
Space group number | 7 |
Hermann-Mauguin space group symbol | P 1 n 1 |
Hall space group symbol | P -2yac |
Residual factor for all reflections | 0.056 |
Residual factor for significantly intense reflections | 0.0505 |
Weighted residual factors for significantly intense reflections | 0.1323 |
Weighted residual factors for all reflections included in the refinement | 0.1361 |
Goodness-of-fit parameter for all reflections included in the refinement | 1.031 |
Diffraction radiation wavelength | 0.71073 Å |
Diffraction radiation type | MoKα |