Information card for entry 7701005
Formula | C13 H12 Cl N3 O Pt |
Calculated formula | C13 H12 Cl N3 O Pt |
Title of publication | A family of readily synthesised phosphorescent platinum(ii) complexes based on tridentate N^N^O-coordinating Schiff-base ligands. |
Authors of publication | Puttock, Emma V.; Fradgley, Jack D.; Yufit, Dmitry S.; Williams, J. A. Gareth |
Journal of publication | Dalton transactions (Cambridge, England : 2003) |
Year of publication | 2019 |
Journal volume | 48 |
Journal issue | 40 |
Pages of publication | 15012 - 15028 |
a | 11.1945 ± 0.0005 Å |
b | 9.595 ± 0.0004 Å |
c | 12.2845 ± 0.0005 Å |
α | 90° |
β | 105.672 ± 0.0014° |
γ | 90° |
Cell volume | 1270.44 ± 0.09 Å3 |
Cell temperature | 120 K |
Ambient diffraction temperature | 120 K |
Number of distinct elements | 6 |
Space group number | 14 |
Hermann-Mauguin space group symbol | P 1 21/c 1 |
Hall space group symbol | -P 2ybc |
Residual factor for all reflections | 0.0142 |
Residual factor for significantly intense reflections | 0.0114 |
Weighted residual factors for significantly intense reflections | 0.0232 |
Weighted residual factors for all reflections included in the refinement | 0.024 |
Goodness-of-fit parameter for all reflections included in the refinement | 1.082 |
Diffraction radiation probe | x-ray |
Diffraction radiation wavelength | 0.71073 Å |
Diffraction radiation type | MoKα |