Information card for entry 7709327
Formula | C4 H8 Cl8 O2 Se2 W2 |
Calculated formula | C4 H8 Cl8 O2 Se2 W2 |
Title of publication | Tungsten(vi) selenide tetrachloride, WSeCl4 – synthesis, properties, coordination complexes and application of [WSeCl4(SenBu2)] for CVD growth of WSe2 thin films |
Authors of publication | Greenacre, Victoria K.; Hector, Andrew L.; Huang, Ruomeng; Levason, William; Sethi, Vikesh; Reid, Gillian |
Journal of publication | Dalton Transactions |
Year of publication | 2022 |
a | 22.117 ± 0.0004 Å |
b | 6.514 ± 0.0001 Å |
c | 11.5767 ± 0.0002 Å |
α | 90° |
β | 90.841 ± 0.002° |
γ | 90° |
Cell volume | 1667.68 ± 0.05 Å3 |
Cell temperature | 100 K |
Ambient diffraction temperature | 100 K |
Number of distinct elements | 6 |
Space group number | 15 |
Hermann-Mauguin space group symbol | C 1 2/c 1 |
Hall space group symbol | -C 2yc |
Residual factor for all reflections | 0.0226 |
Residual factor for significantly intense reflections | 0.0207 |
Weighted residual factors for significantly intense reflections | 0.0487 |
Weighted residual factors for all reflections included in the refinement | 0.0494 |
Goodness-of-fit parameter for all reflections included in the refinement | 1.071 |
Diffraction radiation probe | x-ray |
Diffraction radiation wavelength | 0.71073 Å |
Diffraction radiation type | MoKα |